{"text_format":"3","workbook":"xlsx","n_sheets":5,"sheets":["1 - Opstart Importark","2 - IMPORTARK","Blokke - AMV","Objekt key oversigt","Parametre"],"not_rendered":{"defined_names":126},"read":"whole","date_system":"1900"}

{"sheet":"1 - Opstart Importark","index":0,"n_rows":14,"n_cols":2,"rows_kept":14}
[]
[null,"AMV - Importark"]
[null,"AMV - Importark til ProjectWise af anlægsdokumentation - Version 2.01"]
[null,{"$f":"IF(B6=\"\",\"Husk projektnummer\",\"\")","v":"Husk projektnummer"}]
[null,"Projektnummer"]
[]
[]
[null,"Projektnavn"]
[]
[]
[]
[null,"Blok vælges i grønt felt"]
[]
[null,"Blok"]

{"sheet":"2 - IMPORTARK","index":1,"n_rows":1012,"n_cols":43,"rows_kept":1012,"merged":[[2,4,2,7],[2,17,2,36],[3,17,3,19],[7,17,7,18],[7,19,7,21]]}
[1,2,3,4,5,6,7,8,9,10,11,12,13,14,15,16,17,18,19,20,21,22,23,24,25,26,27,28,29,30,31,32,33,34,35,36,37,38,39,40,40,40,40]
[]
[null,null,"HOFOR",null,"Overordnet information",{"$nulls":4},"KKS","-","DCC","-","Løbenr.","-","Bladnummer.",null,"Meta data",{"$nulls":20},"Skjules"]
[null,null,"AMV - dokumentkode ",{"$nulls":6},"KKS standard + aggregatkode",null,"VGB-S-832-00-2016-04-DE-EN",null,"Bruges til at gøre koden unik",{"$nulls":3},"Søgbare oplysninger til senere fremfindelse af dokumenter"]
[]
[null,null,"Geotag - KKS - DCC - Løbenr.",null,"Importeres","Forside","Filnavn","Bemærkninger til import",{"$nulls":9},"Projekt nr.","Projekt navn","KKS beskr.","Aggregat beskr.","DCC beskr.","Tegnet af ","Tegnet dato","Kontrol af ","Kontrol dato","Godkendt af ","Godkendt dato","Sagsansvarlig","Leverandør","Mål-\nforhold","Farve","A-format","Bemærkning","Fremmed nr. - Eksternt","Gl. dok. nr. 1 HOFOR","Gl. dok. nr. 2 HOFOR",null,"Beskrivelse","el/sro","Objekt filter"]
[]
[{"$nulls":4},"Skal udfyldes",null,null,"Valgfri",null,"Bør udfyldes",null,"Skal udfyldes",null,"Skal udfyldes",null,"Valgfri",null,"Info fra faneblad 1",null,"Bør udfyldes, når der er en KKS-koden ",null,null,"Skal udfyldes",{"$nulls":10},"Valgfri"]
[null,null,"Eksempel på korrekt \nudfyldning af Importark:",null,"Vælg med ja/nej, hvilke dokumenter som skal importeres","Vælg med ja/nej, hvilke PDF-dokumenter som skal have forside","skal udfyldes med filnavnet til dokumentimport \nHusk .filtype","Supplerende information til dokumentimport",null,"KKS1 + KKS2 + KKS3\n+ evt. Strengnr. & Aggregatkode",null,"EMA020",null,"0001",null,"00011",null,"Projekt nr. \nuden fasenr.","Projektnavn","Uddybende KKS - tekst ","Uddybende Aggregat - tekst ","Uddybende DCC - tekst ","Initialer","dato","Initialer","dato","Initialer","dato","Initialer","navn","Intet mål-\nforhold: NA","Hvilket farverum er \ndokumentet i?","Hvilket A-format er dokumentet i?","Ekstra uddybende info om dokumentet","Eksternt nr. \npå dokument","Internt nr. \npå dokument","Internt nr. \npå dokument"]
[]
[null,null,"AMV04LAA10BB001-MQC050_0001",null,"Ja","Ja","Eftersyn.pdf",null,null,"LAA10BB001",null,"MQC050",null,"0001",null,"00011",null,"i2445-02-01","Testprojekt","Eftersyn","Trykbærende udstyr, \nDANAK, FORCE Certification","Godkendelsesrapport","JLAS","2023-06-12","KUSU","2023-06-15","HYTR","2023-06-25","KFRX","ABB","1:50 / NA","Farve","A3","Inspektionsrapport for trykbeholder","ABB3453","DE0177","DE0176/55",null,null,"check af E"]
[{"$nulls":11},"[DCC]",null,"[Lobenr]",null,"[Bladantal]",null,"[Projektnummer]","[Projektnavn]",{"$nulls":3},"[Tegnet af]","[Tegnet dato]","[Kontrolleret af]","[Kontrol dato]","[Godkendt af]","[Godkendt dato]","[Sagsansvarlig]","[Leverandør oplysninger]","[Målforhold]","[PDF_color]","[PDF_pagesize]","[Bemærkning]","[Fremmed nr.]","[Gl_dokumentnavn_1]","[Gl_dokumentnavn_2]","[Do_not_PDF]"]
[1,null,{"$f":"IF('1 - Opstart Importark'!$B$6=\"\",\"\",CONCATENATE('Blokke - AMV'!$B$2,LEFT('1 - Opstart Importark'!$B$15,2),J13,IF(L13=\"\",\"\",\"-\"),L13,IF(N13=\"\",\"\",\"_\"),N13,IF(P13=\"\",\"\",(CONCATENATE(\"_\",P13)))))","v":""},null," "," ",{"$nulls":11},{"$f":"IF(LEN('1 - Opstart Importark'!$B$6)>0,'1 - Opstart Importark'!$B$6,\"\")","v":""},{"$f":"IF(LEN('1 - Opstart Importark'!$B$9)>0,'1 - Opstart Importark'!$B$9,\"\")","v":""},{"$nulls":19},{"$f":"IFERROR(FIND(\".\",G13),)","v":0},{"$f":"IF(L13=\"\",\"\",IF(LEFT(L13,1)=\"E\",0,1))","v":""},{"$f":"CONCATENATE(\"objektnogle_\",LEFT(L13,1))","v":"objektnogle_"}]
[2,null,{"$f":"IF('1 - Opstart Importark'!$B$6=\"\",\"\",CONCATENATE('Blokke - AMV'!$B$2,LEFT('1 - Opstart Importark'!$B$15,2),J14,IF(L14=\"\",\"\",\"-\"),L14,IF(N14=\"\",\"\",\"_\"),N14,IF(P14=\"\",\"\",(CONCATENATE(\"_\",P14)))))","v":""},null," ",{"$nulls":12},{"$f":"IF(LEN('1 - Opstart Importark'!$B$6)>0,'1 - Opstart Importark'!$B$6,\"\")","v":""},{"$f":"IF(LEN('1 - Opstart Importark'!$B$9)>0,'1 - Opstart Importark'!$B$9,\"\")","v":""},{"$nulls":19},0,"","objektnogle_"]
[3,null,{"$f":"IF('1 - Opstart Importark'!$B$6=\"\",\"\",CONCATENATE('Blokke - AMV'!$B$2,LEFT('1 - Opstart Importark'!$B$15,2),J15,IF(L15=\"\",\"\",\"-\"),L15,IF(N15=\"\",\"\",\"_\"),N15,IF(P15=\"\",\"\",(CONCATENATE(\"_\",P15)))))","v":""},null," ",{"$nulls":12},{"$f":"IF(LEN('1 - Opstart Importark'!$B$6)>0,'1 - Opstart Importark'!$B$6,\"\")","v":""},{"$f":"IF(LEN('1 - Opstart Importark'!$B$9)>0,'1 - Opstart Importark'!$B$9,\"\")","v":""},{"$nulls":19},0,"","objektnogle_"]
[4,null,{"$f":"IF('1 - Opstart Importark'!$B$6=\"\",\"\",CONCATENATE('Blokke - AMV'!$B$2,LEFT('1 - Opstart Importark'!$B$15,2),J16,IF(L16=\"\",\"\",\"-\"),L16,IF(N16=\"\",\"\",\"_\"),N16,IF(P16=\"\",\"\",(CONCATENATE(\"_\",P16)))))","v":""},null," ",{"$nulls":12},{"$f":"IF(LEN('1 - Opstart Importark'!$B$6)>0,'1 - Opstart Importark'!$B$6,\"\")","v":""},{"$f":"IF(LEN('1 - Opstart Importark'!$B$9)>0,'1 - Opstart Importark'!$B$9,\"\")","v":""},{"$nulls":19},0,"","objektnogle_"]
[5,null,{"$f":"IF('1 - Opstart Importark'!$B$6=\"\",\"\",CONCATENATE('Blokke - AMV'!$B$2,LEFT('1 - Opstart Importark'!$B$15,2),J17,IF(L17=\"\",\"\",\"-\"),L17,IF(N17=\"\",\"\",\"_\"),N17,IF(P17=\"\",\"\",(CONCATENATE(\"_\",P17)))))","v":""},null," ",{"$nulls":12},{"$f":"IF(LEN('1 - Opstart Importark'!$B$6)>0,'1 - Opstart Importark'!$B$6,\"\")","v":""},{"$f":"IF(LEN('1 - Opstart Importark'!$B$9)>0,'1 - Opstart Importark'!$B$9,\"\")","v":""},{"$nulls":19},0,"","objektnogle_"]
[6,null,{"$f":"IF('1 - Opstart Importark'!$B$6=\"\",\"\",CONCATENATE('Blokke - AMV'!$B$2,LEFT('1 - Opstart Importark'!$B$15,2),J18,IF(L18=\"\",\"\",\"-\"),L18,IF(N18=\"\",\"\",\"_\"),N18,IF(P18=\"\",\"\",(CONCATENATE(\"_\",P18)))))","v":""},null," ",{"$nulls":12},{"$f":"IF(LEN('1 - Opstart Importark'!$B$6)>0,'1 - Opstart Importark'!$B$6,\"\")","v":""},{"$f":"IF(LEN('1 - Opstart Importark'!$B$9)>0,'1 - Opstart Importark'!$B$9,\"\")","v":""},{"$nulls":19},0,"","objektnogle_"]
[7,null,{"$f":"IF('1 - Opstart Importark'!$B$6=\"\",\"\",CONCATENATE('Blokke - AMV'!$B$2,LEFT('1 - Opstart Importark'!$B$15,2),J19,IF(L19=\"\",\"\",\"-\"),L19,IF(N19=\"\",\"\",\"_\"),N19,IF(P19=\"\",\"\",(CONCATENATE(\"_\",P19)))))","v":""},null," "," ",{"$nulls":11},{"$f":"IF(LEN('1 - Opstart Importark'!$B$6)>0,'1 - Opstart Importark'!$B$6,\"\")","v":""},{"$f":"IF(LEN('1 - Opstart Importark'!$B$9)>0,'1 - Opstart Importark'!$B$9,\"\")","v":""},{"$nulls":19},0,"","objektnogle_"]
[8,null,{"$f":"IF('1 - Opstart Importark'!$B$6=\"\",\"\",CONCATENATE('Blokke - AMV'!$B$2,LEFT('1 - Opstart Importark'!$B$15,2),J20,IF(L20=\"\",\"\",\"-\"),L20,IF(N20=\"\",\"\",\"_\"),N20,IF(P20=\"\",\"\",(CONCATENATE(\"_\",P20)))))","v":""},null," ",{"$nulls":12},{"$f":"IF(LEN('1 - Opstart Importark'!$B$6)>0,'1 - Opstart Importark'!$B$6,\"\")","v":""},{"$f":"IF(LEN('1 - Opstart Importark'!$B$9)>0,'1 - Opstart Importark'!$B$9,\"\")","v":""},{"$nulls":19},0,"","objektnogle_"]
[9,null,{"$f":"IF('1 - Opstart Importark'!$B$6=\"\",\"\",CONCATENATE('Blokke - AMV'!$B$2,LEFT('1 - Opstart Importark'!$B$15,2),J21,IF(L21=\"\",\"\",\"-\"),L21,IF(N21=\"\",\"\",\"_\"),N21,IF(P21=\"\",\"\",(CONCATENATE(\"_\",P21)))))","v":""},null," ",{"$nulls":12},{"$f":"IF(LEN('1 - Opstart Importark'!$B$6)>0,'1 - Opstart Importark'!$B$6,\"\")","v":""},{"$f":"IF(LEN('1 - Opstart Importark'!$B$9)>0,'1 - Opstart Importark'!$B$9,\"\")","v":""},{"$nulls":19},0,"","objektnogle_"]
[10,null,{"$f":"IF('1 - Opstart Importark'!$B$6=\"\",\"\",CONCATENATE('Blokke - AMV'!$B$2,LEFT('1 - Opstart Importark'!$B$15,2),J22,IF(L22=\"\",\"\",\"-\"),L22,IF(N22=\"\",\"\",\"_\"),N22,IF(P22=\"\",\"\",(CONCATENATE(\"_\",P22)))))","v":""},null," ",{"$nulls":12},{"$f":"IF(LEN('1 - Opstart Importark'!$B$6)>0,'1 - Opstart Importark'!$B$6,\"\")","v":""},{"$f":"IF(LEN('1 - Opstart Importark'!$B$9)>0,'1 - Opstart Importark'!$B$9,\"\")","v":""},{"$nulls":19},0,"","objektnogle_"]
[11,null,{"$f":"IF('1 - Opstart Importark'!$B$6=\"\",\"\",CONCATENATE('Blokke - AMV'!$B$2,LEFT('1 - Opstart Importark'!$B$15,2),J23,IF(L23=\"\",\"\",\"-\"),L23,IF(N23=\"\",\"\",\"_\"),N23,IF(P23=\"\",\"\",(CONCATENATE(\"_\",P23)))))","v":""},null," ",{"$nulls":12},{"$f":"IF(LEN('1 - Opstart Importark'!$B$6)>0,'1 - Opstart Importark'!$B$6,\"\")","v":""},{"$f":"IF(LEN('1 - Opstart Importark'!$B$9)>0,'1 - Opstart Importark'!$B$9,\"\")","v":""},{"$nulls":19},0,"","objektnogle_"]
[12,null,{"$f":"IF('1 - Opstart Importark'!$B$6=\"\",\"\",CONCATENATE('Blokke - AMV'!$B$2,LEFT('1 - Opstart Importark'!$B$15,2),J24,IF(L24=\"\",\"\",\"-\"),L24,IF(N24=\"\",\"\",\"_\"),N24,IF(P24=\"\",\"\",(CONCATENATE(\"_\",P24)))))","v":""},null," ",{"$nulls":12},{"$f":"IF(LEN('1 - Opstart Importark'!$B$6)>0,'1 - Opstart Importark'!$B$6,\"\")","v":""},{"$f":"IF(LEN('1 - Opstart Importark'!$B$9)>0,'1 - Opstart Importark'!$B$9,\"\")","v":""},{"$nulls":19},0,"","objektnogle_"]
[13,null,{"$f":"IF('1 - Opstart Importark'!$B$6=\"\",\"\",CONCATENATE('Blokke - AMV'!$B$2,LEFT('1 - Opstart Importark'!$B$15,2),J25,IF(L25=\"\",\"\",\"-\"),L25,IF(N25=\"\",\"\",\"_\"),N25,IF(P25=\"\",\"\",(CONCATENATE(\"_\",P25)))))","v":""},null," ",{"$nulls":12},{"$f":"IF(LEN('1 - Opstart Importark'!$B$6)>0,'1 - Opstart Importark'!$B$6,\"\")","v":""},{"$f":"IF(LEN('1 - Opstart Importark'!$B$9)>0,'1 - Opstart Importark'!$B$9,\"\")","v":""},{"$nulls":19},0,"","objektnogle_"]
[14,null,{"$f":"IF('1 - Opstart Importark'!$B$6=\"\",\"\",CONCATENATE('Blokke - AMV'!$B$2,LEFT('1 - Opstart Importark'!$B$15,2),J26,IF(L26=\"\",\"\",\"-\"),L26,IF(N26=\"\",\"\",\"_\"),N26,IF(P26=\"\",\"\",(CONCATENATE(\"_\",P26)))))","v":""},null," ",{"$nulls":12},{"$f":"IF(LEN('1 - Opstart Importark'!$B$6)>0,'1 - Opstart Importark'!$B$6,\"\")","v":""},{"$f":"IF(LEN('1 - Opstart Importark'!$B$9)>0,'1 - Opstart Importark'!$B$9,\"\")","v":""},{"$nulls":19},0,"","objektnogle_"]
[15,null,{"$f":"IF('1 - Opstart Importark'!$B$6=\"\",\"\",CONCATENATE('Blokke - AMV'!$B$2,LEFT('1 - Opstart Importark'!$B$15,2),J27,IF(L27=\"\",\"\",\"-\"),L27,IF(N27=\"\",\"\",\"_\"),N27,IF(P27=\"\",\"\",(CONCATENATE(\"_\",P27)))))","v":""},null," ",{"$nulls":12},{"$f":"IF(LEN('1 - Opstart Importark'!$B$6)>0,'1 - Opstart Importark'!$B$6,\"\")","v":""},{"$f":"IF(LEN('1 - Opstart Importark'!$B$9)>0,'1 - Opstart Importark'!$B$9,\"\")","v":""},{"$nulls":19},0,"","objektnogle_"]
[16,null,{"$f":"IF('1 - Opstart Importark'!$B$6=\"\",\"\",CONCATENATE('Blokke - AMV'!$B$2,LEFT('1 - Opstart Importark'!$B$15,2),J28,IF(L28=\"\",\"\",\"-\"),L28,IF(N28=\"\",\"\",\"_\"),N28,IF(P28=\"\",\"\",(CONCATENATE(\"_\",P28)))))","v":""},null," ",{"$nulls":12},{"$f":"IF(LEN('1 - Opstart Importark'!$B$6)>0,'1 - Opstart Importark'!$B$6,\"\")","v":""},{"$f":"IF(LEN('1 - Opstart Importark'!$B$9)>0,'1 - Opstart Importark'!$B$9,\"\")","v":""},{"$nulls":19},0,"","objektnogle_"]
[17,null,{"$f":"IF('1 - Opstart Importark'!$B$6=\"\",\"\",CONCATENATE('Blokke - AMV'!$B$2,LEFT('1 - Opstart Importark'!$B$15,2),J29,IF(L29=\"\",\"\",\"-\"),L29,IF(N29=\"\",\"\",\"_\"),N29,IF(P29=\"\",\"\",(CONCATENATE(\"_\",P29)))))","v":""},null," ",{"$nulls":12},{"$f":"IF(LEN('1 - Opstart Importark'!$B$6)>0,'1 - Opstart Importark'!$B$6,\"\")","v":""},{"$f":"IF(LEN('1 - Opstart Importark'!$B$9)>0,'1 - Opstart Importark'!$B$9,\"\")","v":""},{"$nulls":19},0,"","objektnogle_"]
[18,null,{"$f":"IF('1 - Opstart Importark'!$B$6=\"\",\"\",CONCATENATE('Blokke - AMV'!$B$2,LEFT('1 - Opstart Importark'!$B$15,2),J30,IF(L30=\"\",\"\",\"-\"),L30,IF(N30=\"\",\"\",\"_\"),N30,IF(P30=\"\",\"\",(CONCATENATE(\"_\",P30)))))","v":""},null," ",{"$nulls":12},{"$f":"IF(LEN('1 - Opstart Importark'!$B$6)>0,'1 - Opstart Importark'!$B$6,\"\")","v":""},{"$f":"IF(LEN('1 - Opstart Importark'!$B$9)>0,'1 - Opstart Importark'!$B$9,\"\")","v":""},{"$nulls":19},0,"","objektnogle_"]
{"$rows_left_out":983}
{"sheet":"Blokke - AMV","index":2,"n_rows":30,"n_cols":2,"rows_kept":30,"hidden":true}
["AMV blokke","Geotag"]
[null,"AMV"]
["00 - AMV Fælles",{"$f":"CONCATENATE($B$2,LEFT(A3,2))","v":"AMV00"}]
["01 - AMV Blok 1",{"$f":"CONCATENATE($B$2,LEFT(A4,2))","v":"AMV01"}]
["02 - AMV Blok 2","AMV02"]
["03 - AMV Blok 3","AMV03"]
["04 - AMV Blok 4","AMV04"]
["12 - AMV Fællesanlæg for Blok 1 og 2","AMV12"]
["20 - AMV Administrationsbygning","AMV20"]
["21 - AMV Losseanlæg","AMV21"]
["22 - AMV Transportanlæg og lager","AMV22"]
["60 - Geotermi","AMV60"]
["71 - Amager Strandvej pumpestation","AMV71"]
["72 - TPW","AMV72"]
[null,{"$f":"CONCATENATE(LEFT(A15,3),MID(A15,5,2))","v":""}]
[null,""]
[null,""]
[null,""]
[null,""]
[null,""]
[null,""]
[null,""]
[null,""]
[null,""]
[null,""]
[null,""]
[null,""]
[null,""]
[null,""]
[null,""]
{"$rows_left_out":1}
{"sheet":"Objekt key oversigt","index":3,"n_rows":96,"n_cols":28,"rows_kept":96,"hidden":true}
[null,null,"LED",null,null,"TEK",null,null,"BYG",null,null,"EL",{"$nulls":3},"SRO",null,null,"MEK",null,null,"liste"]
[null,null,"A - Overordnet ledelse",null,null,"B - Overordnet teknologi",null,null,"C - Bygning Konstruktion",null,"El","E - El & SRO",null,"SRO",null,"SRO",null,null,"M - Maskinteknik inklusiv procesteknik"]
[10120,"Plant revision",{"$nulls":18},"B","B - Overordnet teknologi"]
[12010,"Dates","Anlægsrevision",20510,"Disposal","Affald",35002,null,"Bæringer/fastgørelse",45022,null,"ADK (adgangskontrol)",{"$f":"CONCATENATE($K$2,\" - \",L4)","v":"El - ADK (adgangskontrol)"},50120,"Alarms","Alarmer",65031,null,"Aktuator",null,"C","C - Bygning Konstruktion"]
[11630,"Design, calculations, stress analysis","Datoer",21510,"Plant protection","Anlægsbeskyttelse",35013,null,"Brandmateriel",45009,null,"Aktuator",{"$f":"CONCATENATE($K$2,\" - \",L5)","v":"El - Aktuator"},50140,"Plant protection","Anlægsbeskyttelse",65007,null,"Analog regulator (selvvirkende)",null,"E","E - El & SRO"]
[11810,"Document review","Design, beregninger, stress analyser",20110,"Plant labelling","Anlægsnavngivning (TAG), opmærkning, skiltning",35016,null,"Brønd",40210,"battery chargers","Batteriladere, ladestandere","El - Batteriladere, ladestandere",50150,"Automation","Automation (SRO)",65021,null,"Analogt viserinstrument",null,"M","M - Maskinteknik inklusiv procesteknik"]
[10230,"Operation","Dokumentgennemgang",20120,"Occupational safety","Arbejdssikkerhed",30230,"Building material","Bygningsmaterialer",45021,null,"Beskyttelsesudstyr (fejlstrøm, overstrøm, overspænding)","El - Beskyttelsesudstyr (fejlstrøm, overstrøm, overspænding)",55006,null,"Frekvensomformer",65028,null,"Befugtning, affugtning"]
[10710,"Licensing procedures","Drift",21920,"Protection against internal impacts","Beskyttelse mod interne hændelser",35015,null,"Bygværk",45015,null,"Bygningsinstallationer","El - Bygningsinstallationer",55005,null,"HMI/betjeningspanel/lokal styreboks",65033,null,"Blænder, dyser"]
[10920,"Put into operation","Godkendelsesprocedurer",21930,"Protection against natural impacts","Beskyttelse mod naturlige hændelser",32010,"Doors","Døre",45018,null,"Data installationer","El - Data installationer",55013,null,"Horn",65029,null,"Dosering, opblanding"]
[10220,"Procurement","Idriftsættelse",21910,"Protection against external impacts","Beskyttelse mod ydre hændelser",35003,null,"Elevatorer",45011,null,"Fasekompensering","El - Fasekompensering",51330,"Instrumentation","Instrumentering",65013,null,"Filter/snavssamler"]
[11710,"Quality management","Indkøb",25001,null,"Boring",30610,"Facade construction","Facade",45019,null,"Fastgørelse","El - Fastgørelse",51410,"Communication systems","Kommunikationssystemer",65034,null,"Fittings"]
[11310,"Erection","Kvalitetskontrol",20230,"Fire and explosion control","Brand og eksplosionskontroludstyr",35011,null,"Faldsikring",41120,"Cable routes","Føringsveje","El - Føringsveje",52210,"Control room/stations","Kontrolrum/stationer",65026,null,"Forarbejdning (adsorption, katalyse, reduktion, knusning)"]
[10910,"Commissioning","Opførelse",20410,"Review Design review","Design evaluering",30710,"Foundation","Fundament",40520,"Power transmission","Forsyning (mellemspænding)","El - Forsyning (mellemspænding)",55003,null,"Lokal client",65009,null,"Forbrænding (olie/gas brænder"]
[11910,"Training","Opstart",22320,"In-service inspections","Inspektionsarbejde efter idrifttagelse",35018,null,"Gadeskab",42110,"Converters","Frekvensomformer, omformer","El - Frekvensomformer, omformer",55007,null,"Måler kWh",62220,null,"Forbrugsmaterialer/medier"]
[10610,"Manufacturing","Øvelse",21110,"Corrosion protection","Korrosionsbeskyttelse",30720,"Ground water-proofing","Grundvandssikring",40710,"Direct current and emergency power generation","Jævnstrøms- og nødstrømsanlæg (generator, UPS, batterier)","El - Jævnstrøms- og nødstrømsanlæg (generator, UPS, batterier)",55015,null,"Netværk",65019,null,"Fordamper"]
[11620,"Project documentation","Produktion",25002,null,"Matrikel",35010,null,"Hejseredskaber",40530,"Earthing, Lightning","Jordingsanlæg, potentialudligning","El - Jordingsanlæg, potentialudligning",55012,null,"Nødstopskreds",65022,null,"Isolering"]
[11650,"Project monitoring","Projekt dokumentation",22110,"Environmental protection","Miljøbeskyttelse",35007,null,"Inventar",41110,"Cables, lines","Kabler, forbindelser","El - Kabler, forbindelser",55014,null,"Øvrig opmærkning, advarselsskilte",65008,null,"Kedel",{"$nulls":8},"objektnogle_B"]
[10110,"Project management, administration","Projekt overvågning",21410,"Emergency","Nødberedskab",30210,"Soil investigation","Jordbund",45012,null,"Koblingsudstyr, forsyningsadskiller","El - Koblingsudstyr, forsyningsadskiller",55001,null,"Person beskyttelse (functional safety)",65014,null,"Kompensator"]
[11640,"Project control","Projektledelse, administration",20220,"Pickling, internal cleaning of systems","Præservering, indvendig rensning af systemer",35008,null,"Kloak",45005,null,"Kompressor (integreret motor)","El - Kompressor (integreret motor)",55004,null,"PLC (logikmodul)",65020,null,"Kondensator"]
[11920,"System meetings","Projektstyring",20710,"Track laying","Sporlægning, traceer",35019,null,"Kontrolrum",45002,null,"Lokalt kabinet/styreboks","El - Lokalt kabinet/styreboks",55009,null,"Positioner",65024,null,"Lyddæmper"]
[11610,"Trial operation","Systemiske møder",21210,"Noise protection","Støjbeskyttelse",35004,null,"Lejdere",40220,"Lighting, power installation","Lavspændingsinstallation","El - Lavspændingsinstallation",55011,null,"Programfiler",65030,null,"Materiale transport"]
[10930,"Maintenance","Testkørsel",25000,null,"Terræn",35005,null,"Porte",45013,null,"Måler","El - Måler",55008,null,"Regneværk/omsætter (lokalt)",65036,null,"Øvrig opmærkning, advarselsskilte"]
[null,null,"Vedligehold",20210,"Site development","udvikling af lokation",35021,null,"Procesrum",45014,null,"Måletransformer","El - Måletransformer",55016,null,"SCADA",61610,"Pumps, blowers, compressors","Pumper, ventilatorer, kompressorer"]
[{"$nulls":3},21950,"Road construction, pathway construction","Vejanlæg, midlertidige vejanlæg",35001,null,"Stålkonstruktioner",41310,"Motors","Motorer","El - Motorer",55002,null,"Server",61810,"Piping","Rørinstallation"]
[{"$nulls":6},30220,"Civil drafts, structural calculations","Statik",45003,null,"Øvrig elforbruger","El - Øvrig elforbruger",55010,null,"Signaler",65025,null,"Separator (gas/væskeudskiller)"]
[{"$nulls":6},35017,null,"Sump",45024,null,"Øvrig opmærkning, advarselsskilte","El - Øvrig opmærkning, advarselsskilte",55017,null,"SRO",65011,null,"Skorsten"]
[{"$nulls":6},30410,"Roofing, roof sealing","Tagkonstruktion",45004,null,"Pumpe (integreret motor)","El - Pumpe (integreret motor)",51820,"Closed-loop control","Styring og regulering",60210,"Tanks","Tanke, beholder"]
[{"$nulls":6},35020,null,"Tavlerum",45001,null,"Sikkerhedskomponent, failsafe","El - Sikkerhedskomponent, failsafe",50510,"Installation systems, cabinets, module frames","Systemer, kabinetter, moduler, rammer",65032,null,"Transmission (gear, kobling, bremser, lejer)"]
[{"$nulls":6},35006,null,"Transportredskaber",45010,null,"Støjfilter","El - Støjfilter",50710,"Transmitters","Transmittere",65010,null,"Turbine"]
[{"$nulls":6},35012,null,"Værkstedsmaskiner",45017,null,"Svagstrømsinstallationer","El - Svagstrømsinstallationer",50110,"Equipment protection","Udstyrsbeskyttelse",65035,null,"Værktøj, transportabelt hjælpeudstyr"]
{"$rows_left_out":48}
{"sheet":"Parametre","index":4,"n_rows":8,"n_cols":7,"rows_kept":8,"hidden":true}
["Liste til søgning hovedgrupper - DCC","As-build","Mappe E","PDF_COLOR","PDF_format","Koordinat system","Kotesystem"]
["?"," "]
["A - Overordnet ledelse","Ja","El","Sort/Hvid","A4","UTM32","DVR90"]
["B - Overordnet teknologi","Nej","SRO","Farve","A3","Intet","Intet"]
["C - Byggeri og anlæg",{"$nulls":3},"A2"]
["E - El",{"$nulls":3},"A1"]
["M - Mekanisk konstruktion – Normalt inkl. procesteknik",{"$nulls":3},"A0"]
["P - Procesteknik – kun hvis adskillelse fra mekanisk konstruktion ønskes"]